name,code,total,translated,translated_percent,translated_words_percent,total_words,translated_words,total_chars,translated_chars,translated_chars_percent,failing,failing_percent,fuzzy,fuzzy_percent,url_translate,url,translate_url,last_change,last_author,recent_changes,readonly,readonly_percent,approved,approved_percent,suggestions,comments
Arabic,ar,29,2,6.8,1.6,302,5,1866,39,2.0,0,0.0,0,0.0,,https://translate.yunohost.org/projects/yunohost-apps/-/ar/,https://translate.yunohost.org/translate/yunohost-apps/-/ar/,2024-04-18 17:34:53.917390+00:00,,2,0,0.0,0,0.0,0,0
Basque,eu,29,0,0.0,0.0,302,0,1866,0,0.0,0,0.0,0,0.0,,https://translate.yunohost.org/projects/yunohost-apps/-/eu/,https://translate.yunohost.org/translate/yunohost-apps/-/eu/,,,0,0,0.0,0,0.0,0,0
Bengali (Bangladesh),bn_BD,29,0,0.0,0.0,302,0,1866,0,0.0,0,0.0,0,0.0,,https://translate.yunohost.org/projects/yunohost-apps/-/bn_BD/,https://translate.yunohost.org/translate/yunohost-apps/-/bn_BD/,,,0,0,0.0,0,0.0,0,0
Breton,br,29,0,0.0,0.0,302,0,1866,0,0.0,0,0.0,0,0.0,,https://translate.yunohost.org/projects/yunohost-apps/-/br/,https://translate.yunohost.org/translate/yunohost-apps/-/br/,,,0,0,0.0,0,0.0,0,0
Catalan,ca,40,40,100.0,100.0,414,414,2543,2543,100.0,9,22.5,0,0.0,,https://translate.yunohost.org/projects/yunohost-apps/-/ca/,https://translate.yunohost.org/translate/yunohost-apps/-/ca/,2024-03-29 10:09:51.243081+00:00,,41,0,0.0,0,0.0,0,0
Chinese (Simplified),zh_Hans,29,0,0.0,0.0,302,0,1866,0,0.0,0,0.0,0,0.0,,https://translate.yunohost.org/projects/yunohost-apps/-/zh_Hans/,https://translate.yunohost.org/translate/yunohost-apps/-/zh_Hans/,,,0,0,0.0,0,0.0,0,0
Czech,cs,29,0,0.0,0.0,302,0,1866,0,0.0,0,0.0,0,0.0,,https://translate.yunohost.org/projects/yunohost-apps/-/cs/,https://translate.yunohost.org/translate/yunohost-apps/-/cs/,,,0,0,0.0,0,0.0,0,0
Danish,da,29,0,0.0,0.0,302,0,1866,0,0.0,0,0.0,0,0.0,,https://translate.yunohost.org/projects/yunohost-apps/-/da/,https://translate.yunohost.org/translate/yunohost-apps/-/da/,,,0,0,0.0,0,0.0,0,0
Dutch,nl,40,3,7.5,7.4,414,31,2543,207,8.1,7,17.5,0,0.0,,https://translate.yunohost.org/projects/yunohost-apps/-/nl/,https://translate.yunohost.org/translate/yunohost-apps/-/nl/,2024-03-25 21:06:03.619230+00:00,,5,0,0.0,0,0.0,0,0
English,en,40,40,100.0,100.0,414,414,2543,2543,100.0,9,22.5,0,0.0,,https://translate.yunohost.org/projects/yunohost-apps/-/en/,https://translate.yunohost.org/translate/yunohost-apps/-/en/,,,0,0,0.0,0,0.0,0,0
Esperanto,eo,29,0,0.0,0.0,302,0,1866,0,0.0,0,0.0,0,0.0,,https://translate.yunohost.org/projects/yunohost-apps/-/eo/,https://translate.yunohost.org/translate/yunohost-apps/-/eo/,,,0,0,0.0,0,0.0,0,0
Finnish,fi,29,0,0.0,0.0,302,0,1866,0,0.0,0,0.0,0,0.0,,https://translate.yunohost.org/projects/yunohost-apps/-/fi/,https://translate.yunohost.org/translate/yunohost-apps/-/fi/,,,0,0,0.0,0,0.0,0,0
French,fr,40,40,100.0,100.0,414,414,2543,2543,100.0,9,22.5,0,0.0,,https://translate.yunohost.org/projects/yunohost-apps/-/fr/,https://translate.yunohost.org/translate/yunohost-apps/-/fr/,2024-03-29 14:47:13.528224+00:00,,4,0,0.0,0,0.0,0,0
Galician,gl,29,29,100.0,100.0,302,302,1866,1866,100.0,0,0.0,0,0.0,,https://translate.yunohost.org/projects/yunohost-apps/-/gl/,https://translate.yunohost.org/translate/yunohost-apps/-/gl/,2024-04-04 03:26:37.271907+00:00,,18,0,0.0,0,0.0,0,0
German,de,29,0,0.0,0.0,302,0,1866,0,0.0,0,0.0,0,0.0,,https://translate.yunohost.org/projects/yunohost-apps/-/de/,https://translate.yunohost.org/translate/yunohost-apps/-/de/,,,0,0,0.0,0,0.0,0,0
Greek,el,29,0,0.0,0.0,302,0,1866,0,0.0,0,0.0,0,0.0,,https://translate.yunohost.org/projects/yunohost-apps/-/el/,https://translate.yunohost.org/translate/yunohost-apps/-/el/,,,0,0,0.0,0,0.0,0,0
Hebrew,he,29,0,0.0,0.0,302,0,1866,0,0.0,0,0.0,0,0.0,,https://translate.yunohost.org/projects/yunohost-apps/-/he/,https://translate.yunohost.org/translate/yunohost-apps/-/he/,,,0,0,0.0,0,0.0,0,0
Hindi,hi,29,0,0.0,0.0,302,0,1866,0,0.0,0,0.0,0,0.0,,https://translate.yunohost.org/projects/yunohost-apps/-/hi/,https://translate.yunohost.org/translate/yunohost-apps/-/hi/,,,0,0,0.0,0,0.0,0,0
Hungarian,hu,29,0,0.0,0.0,302,0,1866,0,0.0,0,0.0,0,0.0,,https://translate.yunohost.org/projects/yunohost-apps/-/hu/,https://translate.yunohost.org/translate/yunohost-apps/-/hu/,,,0,0,0.0,0,0.0,0,0
Indonesian,id,29,0,0.0,0.0,302,0,1866,0,0.0,0,0.0,0,0.0,,https://translate.yunohost.org/projects/yunohost-apps/-/id/,https://translate.yunohost.org/translate/yunohost-apps/-/id/,,,0,0,0.0,0,0.0,0,0
Italian,it,29,0,0.0,0.0,302,0,1866,0,0.0,0,0.0,0,0.0,,https://translate.yunohost.org/projects/yunohost-apps/-/it/,https://translate.yunohost.org/translate/yunohost-apps/-/it/,,,0,0,0.0,0,0.0,0,0
Japanese,ja,29,0,0.0,0.0,302,0,1866,0,0.0,0,0.0,0,0.0,,https://translate.yunohost.org/projects/yunohost-apps/-/ja/,https://translate.yunohost.org/translate/yunohost-apps/-/ja/,,,0,0,0.0,0,0.0,0,0
Kabyle,kab,29,0,0.0,0.0,302,0,1866,0,0.0,0,0.0,0,0.0,,https://translate.yunohost.org/projects/yunohost-apps/-/kab/,https://translate.yunohost.org/translate/yunohost-apps/-/kab/,,,0,0,0.0,0,0.0,0,0
Korean,ko,29,0,0.0,0.0,302,0,1866,0,0.0,0,0.0,0,0.0,,https://translate.yunohost.org/projects/yunohost-apps/-/ko/,https://translate.yunohost.org/translate/yunohost-apps/-/ko/,,,0,0,0.0,0,0.0,0,0
Kurdish (Central),ckb,29,0,0.0,0.0,302,0,1866,0,0.0,0,0.0,0,0.0,,https://translate.yunohost.org/projects/yunohost-apps/-/ckb/,https://translate.yunohost.org/translate/yunohost-apps/-/ckb/,,,0,0,0.0,0,0.0,0,0
Lithuanian,lt,29,0,0.0,0.0,302,0,1866,0,0.0,0,0.0,0,0.0,,https://translate.yunohost.org/projects/yunohost-apps/-/lt/,https://translate.yunohost.org/translate/yunohost-apps/-/lt/,,,0,0,0.0,0,0.0,0,0
Macedonian,mk,29,0,0.0,0.0,302,0,1866,0,0.0,0,0.0,0,0.0,,https://translate.yunohost.org/projects/yunohost-apps/-/mk/,https://translate.yunohost.org/translate/yunohost-apps/-/mk/,,,0,0,0.0,0,0.0,0,0
Nepali,ne,29,0,0.0,0.0,302,0,1866,0,0.0,0,0.0,0,0.0,,https://translate.yunohost.org/projects/yunohost-apps/-/ne/,https://translate.yunohost.org/translate/yunohost-apps/-/ne/,,,0,0,0.0,0,0.0,0,0
Norwegian Bokmål,nb_NO,29,0,0.0,0.0,302,0,1866,0,0.0,0,0.0,0,0.0,,https://translate.yunohost.org/projects/yunohost-apps/-/nb_NO/,https://translate.yunohost.org/translate/yunohost-apps/-/nb_NO/,,,0,0,0.0,0,0.0,0,0
Occitan,oc,29,0,0.0,0.0,302,0,1866,0,0.0,0,0.0,0,0.0,,https://translate.yunohost.org/projects/yunohost-apps/-/oc/,https://translate.yunohost.org/translate/yunohost-apps/-/oc/,,,0,0,0.0,0,0.0,0,0
Persian,fa,29,0,0.0,0.0,302,0,1866,0,0.0,0,0.0,0,0.0,,https://translate.yunohost.org/projects/yunohost-apps/-/fa/,https://translate.yunohost.org/translate/yunohost-apps/-/fa/,,,0,0,0.0,0,0.0,0,0
Polish,pl,29,0,0.0,0.0,302,0,1866,0,0.0,0,0.0,0,0.0,,https://translate.yunohost.org/projects/yunohost-apps/-/pl/,https://translate.yunohost.org/translate/yunohost-apps/-/pl/,,,0,0,0.0,0,0.0,0,0
Portuguese,pt,29,0,0.0,0.0,302,0,1866,0,0.0,0,0.0,0,0.0,,https://translate.yunohost.org/projects/yunohost-apps/-/pt/,https://translate.yunohost.org/translate/yunohost-apps/-/pt/,,,0,0,0.0,0,0.0,0,0
Portuguese (Brazil),pt_BR,29,0,0.0,0.0,302,0,1866,0,0.0,0,0.0,0,0.0,,https://translate.yunohost.org/projects/yunohost-apps/-/pt_BR/,https://translate.yunohost.org/translate/yunohost-apps/-/pt_BR/,,,0,0,0.0,0,0.0,0,0
Russian,ru,29,0,0.0,0.0,302,0,1866,0,0.0,0,0.0,0,0.0,,https://translate.yunohost.org/projects/yunohost-apps/-/ru/,https://translate.yunohost.org/translate/yunohost-apps/-/ru/,,,0,0,0.0,0,0.0,0,0
Slovak,sk,29,0,0.0,0.0,302,0,1866,0,0.0,0,0.0,0,0.0,,https://translate.yunohost.org/projects/yunohost-apps/-/sk/,https://translate.yunohost.org/translate/yunohost-apps/-/sk/,,,0,0,0.0,0,0.0,0,0
Slovenian,sl,29,0,0.0,0.0,302,0,1866,0,0.0,0,0.0,0,0.0,,https://translate.yunohost.org/projects/yunohost-apps/-/sl/,https://translate.yunohost.org/translate/yunohost-apps/-/sl/,,,0,0,0.0,0,0.0,0,0
Spanish,es,29,7,24.1,20.5,302,62,1866,380,20.3,2,6.8,11,37.9,,https://translate.yunohost.org/projects/yunohost-apps/-/es/,https://translate.yunohost.org/translate/yunohost-apps/-/es/,2024-05-11 03:40:53.062797+00:00,,18,0,0.0,0,0.0,0,0
Swedish,sv,29,0,0.0,0.0,302,0,1866,0,0.0,0,0.0,0,0.0,,https://translate.yunohost.org/projects/yunohost-apps/-/sv/,https://translate.yunohost.org/translate/yunohost-apps/-/sv/,,,0,0,0.0,0,0.0,0,0
Telugu,te,29,0,0.0,0.0,302,0,1866,0,0.0,0,0.0,0,0.0,,https://translate.yunohost.org/projects/yunohost-apps/-/te/,https://translate.yunohost.org/translate/yunohost-apps/-/te/,,,0,0,0.0,0,0.0,0,0
Turkish,tr,29,0,0.0,0.0,302,0,1866,0,0.0,0,0.0,0,0.0,,https://translate.yunohost.org/projects/yunohost-apps/-/tr/,https://translate.yunohost.org/translate/yunohost-apps/-/tr/,,,0,0,0.0,0,0.0,0,0
Ukrainian,uk,29,0,0.0,0.0,302,0,1866,0,0.0,0,0.0,0,0.0,,https://translate.yunohost.org/projects/yunohost-apps/-/uk/,https://translate.yunohost.org/translate/yunohost-apps/-/uk/,,,0,0,0.0,0,0.0,0,0
